Nicaragua
type: Thing
type: Concept
main entity of page: https://data.bibliotheken.nl/.well-known/genid/ddd69e77662d91173b7006239142989b
in scheme: brinkman
related match: (728.5)
scope note: Nicaragua, officieel de Republiek Nicaragua, is een land in Centraal-Amerika dat in het noorden grenst aan Honduras, in het zuiden aan Costa Rica, in het westen aan de Grote Oceaan en in het oosten aan de Caribische Zee. De hoofdstad van het land is Managua