Mexico (land)
type: Thing
type: Concept
main entity of page: https://data.bibliotheken.nl/.well-known/genid/a1dcce221fa4e444abcb67cc2909a9d4
in scheme: brinkman
related match: (72)
scope note: Mexico (Spaans: México of Méjico), officieel de Verenigde Mexicaanse Staten (Spaans: Estados Unidos Mexicanos)[5] is een land in Noord-Amerika