Markerwaard
type: Thing
type: Concept
main entity of page: https://data.bibliotheken.nl/.well-known/genid/2efa9e134d0d2dc3da687ea78c001692
alternative label: Polder Markerwaard
in scheme: brinkman
scope note: Markerwaard is de naam van een gedurende de hele 20e eeuw geplande en door de Nederlandse regering in portefeuille gehouden IJsselmeerpolder, die echter nooit is aangelegd.