Lübeck
type: Thing
type: Concept
main entity of page: https://data.bibliotheken.nl/.well-known/genid/c101d515c408c601c5034ba44d8b6e6a
broader: p07567470X
in scheme: brinkman
scope note: De Hanzestad Lübeck is een kreisfreie Stadt aan de monding van de Trave in de Duitse deelstaat Sleeswijk-Holstein