Latijns-Amerika
type: Thing
type: Concept
main entity of page: https://data.bibliotheken.nl/.well-known/genid/f7ed6d0f77248cddad9fbbc490fefd99
broader: p339707062
in scheme: brinkman
related: p075640430
related: p075672189
related: p07563466X
scope note: Formeel gesproken is het het gebied ten zuiden van de Verenigde Staten. Soms wordt het Caribisch gebied hiervan losgekoppeld
scope note: Er is ook Midden- en Zuid-Amerika en Caribisch gebied