Japan
type: Thing
type: Concept
main entity of page: https://data.bibliotheken.nl/.well-known/genid/ac526e1d895fb86ca4b13471872c12d0
alternative label: Nihon
alternative label: Nippon
in scheme: brinkman
related match: (520)
scope note: Japan (Japans: 日本, Nippon, Nihon, met de letterlijke betekenis: oorsprong van de zon; de naam voor het oude Japan is 大和,Yamato) is een eilandstaat ten oosten van het Aziatische continent