Groot-Brittannië
type: Thing
type: Concept
main entity of page: https://data.bibliotheken.nl/.well-known/genid/7044575ec373a5fad9ecc8ab45475d69
broader: p075634031
in scheme: brinkman
related match: (41)
scope note: vanaf 1707, toen Engeland en Schotland onder één kroon kwamen. (Act of Union of Scotland). Sinds 1282 was het prinsdom Wales al verenigd met Engeland