Denemarken
type: Thing
type: Concept
main entity of page: https://data.bibliotheken.nl/.well-known/genid/539d85d8a06e39b495720f7c62d88e1c
in scheme: brinkman
related match: (489)
scope note: Denemarken (Deens: Danmark), is een land in Scandinavië, in het noorden van Europa. Denemarken vormt samen met Groenland en de Faeröer het Koninkrijk Denemarken (Deens: Kongeriget Danmark)