El Salvador
type: Thing
type: Concept
main entity of page: https://data.bibliotheken.nl/.well-known/genid/df7db533001028126143fbc619382e15
in scheme: brinkman
scope note: El Salvador, officieel de Republiek El Salvador, is een land in Centraal-Amerika