Anna Paulowna
type: Thing
type: Concept
main entity of page: https://data.bibliotheken.nl/.well-known/genid/b614543b295aae33233a6ab3dbd10afe
broader: p075632861
in scheme: brinkman
related match: (492*1760)
scope note: per 1 januari 2012 dorp in de gemeente Hollands Kroon